{"text_format":"1","workbook":"xlsx","n_sheets":4,"sheets":["Vergleich","Rohdaten","Listen","Tabelle3"],"not_rendered":{"charts":0,"images":0,"macros":1,"external_links":0,"defined_names":2,"comments":0,"pivot_tables":0},"unopened":[],"bounds":{"document_bytes":16777216,"sheet_cells":100000,"rows_first":2000,"rows_last":500,"rows_between":2000,"halvings":0,"cell_chars":16384,"cell_head_chars":4096},"cells_cut":0,"cells_raw":0,"read":"whole","date_system":"1900"}

{"sheet":"Vergleich","index":0,"n_rows":42,"n_cols":12,"rows_kept":42,"cut":false,"hidden":false,"merged":[[22,0,33,0],[36,0,41,0],[2,0,14,0],[15,0,21,0]]}
[null,null,"Hier Tarif 1 auswählen","Hier Tarif 2 auswählen"]
[null,"Tarifname","SIGNAL IDUNA - GesundAKTIV+","AXA - FlexMed easyPremium",null,{"$f":"HLOOKUP(C2,Rohdaten!1:2,2,FALSE)","v":2},{"$f":"HLOOKUP(D2,Rohdaten!1:2,2,FALSE)","v":15},null,null,null,"Passwort\n(Blattschutz):","psekv-94410"]
["ALLGEMEIN","Tarifeinführung",{"$f":"VLOOKUP($B3,Rohdaten!$A$1:$AT$43,$F$2,FALSE)","v":"2022-10-18"},{"$f":"VLOOKUP($B3,Rohdaten!$A$1:$AT$43,$G$2,FALSE)","v":"2025-09-01"}]
[null,"Budgetstufen",{"$f":"VLOOKUP($B4,Rohdaten!$A$1:$AT$43,$F$2,FALSE)","v":"300/600/900/1200/1500"},{"$f":"VLOOKUP($B4,Rohdaten!$A$1:$AT$43,$G$2,FALSE)","v":"300/600/900/ 1200/ 1500"}]
[null,"Mindestzahl",{"$f":"VLOOKUP($B5,Rohdaten!$A$1:$AT$43,$F$2,FALSE)","v":"ab 3 MA"},{"$f":"VLOOKUP($B5,Rohdaten!$A$1:$AT$43,$G$2,FALSE)","v":"ab 5 MA ab Budgetstufe 600, sonst ab 10 MA"}]
[null,"Auch für PKV-Versicherte",{"$f":"VLOOKUP($B6,Rohdaten!$A$1:$AT$43,$F$2,FALSE)","v":"Ja"},{"$f":"VLOOKUP($B6,Rohdaten!$A$1:$AT$43,$G$2,FALSE)","v":"Ja"}]
[null,"Ohne Gesundheitsprüfung",{"$f":"VLOOKUP($B7,Rohdaten!$A$1:$AT$43,$F$2,FALSE)","v":"Ja"},{"$f":"VLOOKUP($B7,Rohdaten!$A$1:$AT$43,$G$2,FALSE)","v":"Ja"}]
[null,"Volles Budget bei unterjährigem Beginn",{"$f":"VLOOKUP($B8,Rohdaten!$A$1:$AT$43,$F$2,FALSE)","v":"Ja"},{"$f":"VLOOKUP($B8,Rohdaten!$A$1:$AT$43,$G$2,FALSE)","v":"Ja"}]
[null,"Mitvers. fehlender Zähne",{"$f":"VLOOKUP($B9,Rohdaten!$A$1:$AT$43,$F$2,FALSE)","v":"Ja"},{"$f":"VLOOKUP($B9,Rohdaten!$A$1:$AT$43,$G$2,FALSE)","v":"Ja"}]
[null,"Leistungen für angeratene/ laufende Behandlungen",{"$f":"VLOOKUP($B10,Rohdaten!$A$1:$AT$43,$F$2,FALSE)","v":"Ja"},{"$f":"VLOOKUP($B10,Rohdaten!$A$1:$AT$43,$G$2,FALSE)","v":"Ja"}]
[null,"Assistanceleistungen",{"$f":"VLOOKUP($B11,Rohdaten!$A$1:$AT$43,$F$2,FALSE)","v":"Ja"},{"$f":"VLOOKUP($B11,Rohdaten!$A$1:$AT$43,$G$2,FALSE)","v":"Ja, zum Teil kostenpflichtig"}]
[null,"Beitragsbefreiung (b. AU > 6 Wo, Eltern-, Familienpflegezeit)",{"$f":"VLOOKUP($B12,Rohdaten!$A$1:$AT$43,$F$2,FALSE)","v":"Ja"},{"$f":"VLOOKUP($B12,Rohdaten!$A$1:$AT$43,$G$2,FALSE)","v":"Ja"}]
[null,"Weiterversicherung ",{"$f":"VLOOKUP($B13,Rohdaten!$A$1:$AT$43,$F$2,FALSE)","v":"Ja"},{"$f":"VLOOKUP($B13,Rohdaten!$A$1:$AT$43,$G$2,FALSE)","v":"Ja, in Einzeltarifen"}]
[null,"Mitvers. Familienangehörige",{"$f":"VLOOKUP($B14,Rohdaten!$A$1:$AT$43,$F$2,FALSE)","v":"Ja"},{"$f":"VLOOKUP($B14,Rohdaten!$A$1:$AT$43,$G$2,FALSE)","v":"Ja, ab 50 MA in Einzeltarifen"}]
[null,"Ohne Gesundheitsprüfung (Angehörige)",{"$f":"VLOOKUP($B15,Rohdaten!$A$1:$AT$43,$F$2,FALSE)","v":"Ja (für Budget 300/600)"},{"$f":"VLOOKUP($B15,Rohdaten!$A$1:$AT$43,$G$2,FALSE)","v":"Nein"}]
["ZAHN","Zahnersatz (Implantate, Brücken, Kronen)",{"$f":"VLOOKUP($B16,Rohdaten!$A$1:$AT$43,$F$2,FALSE)","v":"Ja"},{"$f":"VLOOKUP($B16,Rohdaten!$A$1:$AT$43,$G$2,FALSE)","v":"Ja"}]
[null,"Kieferorthopädie nach Unfall",{"$f":"VLOOKUP($B17,Rohdaten!$A$1:$AT$43,$F$2,FALSE)","v":"Ja"},{"$f":"VLOOKUP($B17,Rohdaten!$A$1:$AT$43,$G$2,FALSE)","v":"Ja"}]
[null,"Zahnbehandlung",{"$f":"VLOOKUP($B18,Rohdaten!$A$1:$AT$43,$F$2,FALSE)","v":"Ja"},{"$f":"VLOOKUP($B18,Rohdaten!$A$1:$AT$43,$G$2,FALSE)","v":"Ja"}]
[null,"Prof. Zahnreinigung",{"$f":"VLOOKUP($B19,Rohdaten!$A$1:$AT$43,$F$2,FALSE)","v":"max. 300€ jährlich"},{"$f":"VLOOKUP($B19,Rohdaten!$A$1:$AT$43,$G$2,FALSE)","v":"Ja"}]
[null,"Bleaching ",{"$f":"VLOOKUP($B20,Rohdaten!$A$1:$AT$43,$F$2,FALSE)","v":"max. 100€ jährlich"},{"$f":"VLOOKUP($B20,Rohdaten!$A$1:$AT$43,$G$2,FALSE)","v":"max. 80€ jährlich"}]
{"$rows_left_out":23}
{"sheet":"Rohdaten","index":1,"n_rows":45,"n_cols":62,"rows_kept":45,"cut":false,"hidden":true,"merged":[]}
["Tarifname","SIGNAL IDUNA - GesundAKTIV+","ALLIANZ - MeinGesundheitsBudget (alt)","Allianz - MeineGesundheit (neu)","Allianz - MeineGesundheit (neu) + RundumZahn 70","Allianz - MeineGesundheit (neu) + RundumZahn 90","Allianz - MeineGesundheit (neu) + RundumZahn 100","Allianz - MeineGesundheit (neu) + Sehhilfe 100","Allianz - MeineGesundheit (neu) + SehhilfeExtra","ARAG - BudgetFlex Komfort","ARAG - BudgetFlex Premium","AXA - FlexMed easy","AXA - FlexMed easy (neu)","AXA - FlexMed easyPLUS","AXA - FlexMed easyPremium","BARMENIA - WellYouStart","BARMENIA - WellYou","Debeka - DebeCare","Debeka - DebeCare Plus","Debeka - DebeCare Best","Münchener Verein - GemeinsamGesundBudget","GOTHAER - FlexSelect","GOTHAER - FlexSelectPremium1","GOTHAER - FlexSelectXL1","GOTHAER - FlexSelect FAN","HALLESCHE - FEELfree","HALLESCHE - FEELfree-up 1","NÜRNBERGER - BudgetSelect","NÜRNBERGER - BudgetSelect mit Zahnersatz","OTTNOVA - CrewCare","R+V - Budget PROFIL","CONTINENTALE - ConCept Choose","CONTINENTALE - ConCept Choose More","CONTINENTALE - ConCept Choose Max 1","UKV/BBKK - BudgetPro","Württembergische - Startbudget","Württembergische - Budget","Hanse Merkur - BKB","Hanse Merkur - BKBT","DKV - BonusMed Budget (BBT)","LKH - TeamUpgrade Fit","LKH - TeamUpgrade Smile","Generali - Buisness+","R+V - Budget PROFIL team (2023)","R+V - Budget PROFIL (2023)","  "," "," "," "," "," "," "," "," "," "," "," "," "," "," "," "," "]
[1,2,3,4,5,6,7,8,9,10,11,12,13,14,15,16,17,18,19,20,21,22,23,24,25,26,27,28,29,30,31,32,33,34,35,36,37,38,39,40,41,42,43,44,45]
["Tarifeinführung","2022-10-18","2021-04-01","2025-04-01","2025-04-01","2025-04-01","2025-04-01","2025-04-01","2025-04-01","2022-10-01","2022-10-01","2021-07-19","2023-03-01","2023-03-01","2025-09-01","2021-03-01","2021-03-01","2024-01-01","2024-01-01","2024-01-01","2023-05-01","2020-10-01","2022-10-01","2022-10-01","2023-07-01","2018-10-01","2022-05-01","2022-07-01","2022-07-01","2022-10-01","2022-07-01","2020-11-01","2023-04-01","2023-04-01","2022-12-19","2023-07-01","2023-07-01","2023-09-01","2023-09-01","2023-10-01","2023-10-01","2023-10-02","2022-07-01","2023-12-01","2023-12-01"]
["Budgetstufen","300/600/900/1200/1500","300*/600/900/1200/1500","300*/600/900/1200/1500","300*/600/900/1200/1500","300*/600/900/1200/1500","300*/600/900/1200/1500","300*/600/900/1200/1500","300*/600/900/1200/1500","300/600/900/1200/1500","300/600/900/1200/1500","300/600/900","300/600/900/ 1200/ 1500","300/600/900/ 1200/ 1500","300/600/900/ 1200/ 1500",300,"300/600/900","300/600/1000/1500","300/600/1000/1500","300/600/1000/1500","300/600/1000/1500","300/500/750","300/500/750/1000/1250","300/500/750","300/500/750/1000/1250\nVerdopplung bei Arbeitsunfall","300/600/900/1200/1500","300/600/900/1200/1500","300/600/900/1.200","300/600/900/1.200","300/600/900/1.200/1.500","300/600/900","400/800/1200","400/800/1200/1600","400/800/1200/1600","400/800/1200",300,"300/600/900/1200","300/600/900/ 1200/ 1500/ 1700","300/600/900/ 1200/ 1500/ 1700","300/600/900/ 1200","300/600/900/ 1200/ 1500","300/600/900/ 1200/ 1500","300/600/900/ 1200/ 1500","300/600/900/ 1200/ 1500","300/600/900/ 1200/ 1500"]
["Mindestzahl","ab 3 MA","Ab 10 MA**","Ab 5 MA","Ab 5 MA","Ab 5 MA","Ab 5 MA","Ab 5 MA","Ab 5 MA","10 MA","10 MA","10 MA, mind. 90 %","ab 5 MA","ab 10MA","ab 5 MA ab Budgetstufe 600, sonst ab 10 MA","20 MA, mind. 90 %","5 MA, mind. 90 %","Ab 10 MA","Ab 10 MA","Ab 10 MA","Ab 5 MA*/ Ab 10 MA","5 MA, mind. 90 %","5 MA, mind. 90 %","Ab 500 MA","Ab 5 MA","10 MA","10 MA","ab 5 MA","ab 5 MA","ab 5 MA","ab 5 MA","10 MA","10 MA","10 MA","10 MA","ab 3 MA","ab 3 MA","ab 5 MA","ab 5 MA","ab 10MA","ab 5 MA","ab 5 MA","ab 5 MA, mind 80%","ab 5 MA ","ab 10 MA  "]
["Auch für PKV-Versicherte","Ja","Ja","Ja","Ja","Ja","Ja","Ja","Ja","Ja","Ja","Ja","Ja","Ja","Ja","Ja","Ja","Ja","Ja","Ja","Ja","Ja","Ja","Ja","Ja","Ja","Ja","Ja","Ja","Ja","Ja","Ja","Ja","Ja","Ja","Ja","Ja","Ja","Ja","Ja","Ja","Ja","Ja","Ja","Ja"]
["Ohne Gesundheitsprüfung","Ja","Ja","Ja","Ja","Ja","Ja","Ja","Ja","Ja","Ja","Ja","Ja","Ja","Ja","Ja","Ja","Ja","Ja","Ja","Ja","Ja","Ja","Ja","Ja - Mit Einschränkungen*\n","Ja","Ja","Ja","Ja","Ja","Ja","Ja","Ja","Ja","Ja","Ja","Ja","Ja","Ja","Ja","Ja","Ja","Ja","Ja","Ja"]
["Volles Budget bei unterjährigem Beginn","Ja","Ja","Ja","Ja","Ja","Ja","Ja","Ja","Ja","Ja","Ja","Ja","Ja","Ja","Ja","Ja","Ja","Ja","Ja","Ja","Nein","Ja","Ja","Ja","Nein","Ja","Ja","Ja","Ja","Kürzung um 1/12 eines jeden nicht versicherten Monats","Nein","Ja","Ja","Ja","Nein","Nein","Ja","Ja","Ja","Ja","Ja","Ja","Nein","Ja"]
["Mitvers. fehlender Zähne","Ja","Ja","Ja","Ja","Ja","Ja","Ja","Ja","Ja","Ja","Ja","Ja","Ja","Ja","Ja","Ja","Ja","Ja","Ja","Ja","Ja","Ja","Ja","Ja","Ja","Ja","Ja","Ja","Ja","Ja","Ja","Ja","Ja","Ja","Ja","Ja","Ja","Ja","Ja","Ja","Ja","Ja","Nein","Ja"]
["Leistungen für angeratene/ laufende Behandlungen","Ja","Ja","Ja","Ja","Ja","Ja","Ja","Ja","Ja","Ja","Ja","Ja","Ja","Ja","Ja","Ja",null,null,null,"Ja","Ja","Ja","Ja","Ja, für Gruppenverträge ohne Gesundheitsprüfung","Ja","Ja","Ja","Ja","Ja","Ja","Ja","Ja","Ja","Ja","Ja","Ja","Ja","Ja","Ja","Nein","Nein","Ja","Nein","Ja"]
["Assistanceleistungen","Ja","Ja","Ja","Ja","Ja","Ja","Ja","Ja","Ja","Ja","Ja","Ja","Ja","Ja, zum Teil kostenpflichtig","Ja","Ja","Ja","Ja","Ja","Ja","Ja","Ja","Ja","Ja","Ja","Ja","Ja","Ja","Ja","Ja","Ja","Ja","Ja","Ja","Ja","Ja","Ja","Ja","Ja","Ja","Ja","Ja","Ja","Ja"]
["Beitragsbefreiung (b. AU > 6 Wo, Eltern-, Familienpflegezeit)","Ja","Ja","Ja","Ja","Ja","Ja","Ja","Ja","Ja","Ja","Ja","Ja","Ja","Ja","Ja","Ja","Ja, bis zu 36 Monate","Ja, bis zu 36 Monate","Ja, bis zu 36 Monate","Ja","Ja","Ja","Ja","Ja","Ja","Ja","Ja","Ja","Ja","Mitarbeiter muss auf eigene Rechnung fortführen","Ja","Ja","Ja","Ja","Ja","Ja","Ja, gegen Zuschlag","Ja, gegen Zuschlag","Nein","Max 12 Monate","Max 12 Monate","Nein","Nein","Ja"]
["Weiterversicherung ","Ja","Ja \nin Einzeltarifen","Ja \nin Einzeltarifen","Ja \nin Einzeltarifen","Ja \nin Einzeltarifen","Ja \nin Einzeltarifen","Ja \nin Einzeltarifen","Ja \nin Einzeltarifen","Ja","Ja","Ja \nin Einzeltarifen","Ja \nin Einzeltarifen","Nein","Ja, in Einzeltarifen","Nein","Ja","Ja \nin Einzeltarifen","Ja \nin Einzeltarifen","Ja \nin Einzeltarifen","Ja","Nein","Nein","Nein","Ja","Ja \nin Einzeltarifen","Ja \nin Einzeltarifen","Ja","Ja","Nein","Nein","Ja","Ja","Ja","Ja","Ja","Ja","Ja","Ja","Ja","Nein","Nein","Ja, im Buisness+ AF","Ja, über die Tariflinie individual","Ja, über die Tariflinie individual"]
["Mitvers. Familienangehörige","Ja","Ja \nin Einzeltarifen","Ja \nin Einzeltarifen","Ja \nin Einzeltarifen","Ja \nin Einzeltarifen","Ja \nin Einzeltarifen","Ja \nin Einzeltarifen","Ja \nin Einzeltarifen","Ja","Ja","Ja \nin Einzeltarifen","Ja, ab 50 MA in Einzeltarifen","Ja, ab 50 MA in Einzeltarifen","Ja, ab 50 MA in Einzeltarifen","Nein","Ja","Ja","Ja","Ja","Ja","Nein","Nein","Nein","Ja","Nein","Ja \nin Einzeltarifen","Ja","Ja","Nein\nIst momentan noch nicht möglich","Nein","Ja","Ja","Ja","Ja","Ja","Ja","Ja","Ja","Ja, in Tariflinie BonusMed Kompakt","Nein","Nein","Ja","Ja, über die Tariflinie individual","Ja, über die Tariflinie individual"]
["Ohne Gesundheitsprüfung (Angehörige)","Ja (für Budget 300/600)","Nein","Ja (Öffnungsklausel von 12 Monaten)","Ja (Öffnungsklausel von 12 Monaten)","Ja (Öffnungsklausel von 12 Monaten)","Ja (Öffnungsklausel von 12 Monaten)","Ja (Öffnungsklausel von 12 Monaten)","Ja (Öffnungsklausel von 12 Monaten)","Ja (Öffnungsklausel von 3 Monaten)","Ja (Öffnungsklausel von 3 Monaten)","Ja (Öffnungsklausel)","Nein","Nein","Nein","Nein","Ja (für gleichen Tarif wie AN, außer lfd./angeratene Behandlungen und fehlende Zähne) ","Ja (Öffnungsklausel von 3 Monaten für gleiche/n Tarif/e wie AN)","Ja (Öffnungsklausel von 3 Monaten für gleiche/n Tarif/e wie AN)","Ja (Öffnungsklausel von 3 Monaten für gleiche/n Tarif/e wie AN)","Ja (Öffnungsklausel von 3 Monaten)","Nein","Nein","Nein","Ja (Öffnungsklausel von  Monaten, außer Schwerstdiagnosen)","Nein","Ja (Öffnungsklausel)","Ja (Öffnungsklausel von 6 Monaten)","Ja (Öffnungsklausel von 6 Monaten)","Nein","Ja (Öffnungsklausel von 6 Monaten)","Ja (Öffnungsklausel von 3 Monaten)","Ja (Öffnungsklausel von 3 Monaten)","Ja (Öffnungsklausel von 3 Monaten)","Keine Informationen","Ja (Öffnungsklausel von 6 Monaten)","Ja (Öffnungsklausel von 6 Monaten)","Ja","Ja","Ja (Öffnungsklausel von 3 Monaten)","Nein","Nein","Ja (Öffnungsklausel von 6 Monaten)","Ja (Öffnungsklausel von 6 Monaten - Höchstalter 60)","Ja (Öffnungsklausel von 6 Monaten - Höchstalter 60)"]
["Zahnersatz (Implantate, Brücken, Kronen)","Ja","Ja","Ja","70% außerhalb des Budgets","90% außerhalb des Budgets","100% außerhalb des Budgets","Ja","Ja","Ja","Ja","Ja","Ja","Nein","Ja","Ja","Ja","Nein","50% vom Rechnungsbetrag","30% vom Rechnungsbetrag","Ja","Ja","Ja","Ja","Ja","Ja","Ja","Nein","Ja","Ja","Nein","Ja","Ja","Ja","Ja","Optional","Optional","Ja","Ja","Ja","Nein","Ja","Nein","Ja","Ja"]
["Kieferorthopädie nach Unfall","Ja","inkl. schwere Erkrank.","inkl. schwere Erkrank.","70% außerhalb des Budgets\ninkl. schwere Erkrank.","90% außerhalb des Budgets\ninkl. schwere Erkrank.","100% außerhalb des Budgets\ninkl. schwere Erkrank.","inkl. schwere Erkrank.","inkl. schwere Erkrank.","Ja","Ja","Nein","Nein","Nein","Ja","Ja","Ja","Nein","Nein","Nein","Ja","Nein","Ja","Ja","Ja","Nein","Nein","Nein","Ja","Nein","Nein","Nein","Ja","Ja","Nein","Nein","Ja","Ja","Ja","Nein","Nein","Ja","Nein","Ja","Ja"]
["Zahnbehandlung","Ja","Ja","Ja","Ja, außerhalb des Budgets","Ja, außerhalb des Budgets","Ja, außerhalb des Budgets","Ja","Ja","Ja","Ja","Ja","Ja","Ja","Ja","Ja","Ja","Nein","Nein","Nein","Ja","Ja","Ja","Ja","Ja","Ja","Ja","Ja","Ja","Ja","Bei 300 € Budget: 120 EUR\nBei 600 € Budget: 240 EUR\nBei 900 € Budget: 360 EUR","Ja","Ja","Ja","Ja","Nein","Ja","Ja","Ja","Ja","Nein","Ja","Nein","Ja","Ja"]
["Prof. Zahnreinigung","max. 300€ jährlich","insgesamt max. 80-160€ jährlich. je nach Budgethöhe","Ja","Ja, außerhalb des Budgets","Ja, außerhalb des Budgets","Ja, außerhalb des Budgets","Ja","Ja","max. 80 € jährlich","Ja","max. 80€ jährlich","Gesamtleistung (inkl. Bleaching) max. 80€ jährlich","Ja","Ja","max. 60€ jährlich","Ja","2x jährlich","2x jährlich","2x jährlich","Ja","max. 80€ jährlich","Ja","Ja","Ja","insgesamt bis max. 60€ jährlich","insgesamt bis max. 100€/KJ","Ja","Ja","max. 125€ jährlich","Bei 300 € Budget: 120 EUR\nBei 600 € Budget: 240 EUR\nBei 900 € Budget: 360 EUR","max. 75€ jährlich","max. 250€ jährlich","Ja","Ja","max. 40 € jährlich","max. 80 € jährlich","Tarifstufe 300 bis 600= 80 € jährlich\nTarifstufe 600 bis 900= 100 € jährlich\nTarifstufe ab 900= 120 € jährlich","Tarifstufe 300 bis 600= 200 € jährlich\nTarifstufe 600 bis 900= 250 € jährlich\nTarifstufe ab 900= 300 € jährlich","Ja","Ja","Ja","max. 100€ jährlich","Ja","Ja"]
["Bleaching ","max. 100€ jährlich","insgesamt max. 80-160€ jährlich. je nach Budgethöhe","Ja","max. 150€ innerhalb von 2 Kalenderjahren außerhalb des Budgets","max. 150€ innerhalb von 2 Kalenderjahren außerhalb des Budgets","max. 150€ innerhalb von 2 Kalenderjahren außerhalb des Budgets","Ja","Ja","Nein","Nein","Nein","Gesamtleistung (inkl. Zahnprophylaxe) max. 80€ jährlich","max. 80€ jährlich","max. 80€ jährlich","Nein","Nein","Nein","Nein","Nein","Nein","Nein","Nein","Nein","Nein","insgesamt bis max. 60€ jährlich","insgesamt bis max. 100€/KJ","Ja","Ja","max. 125€ jährlich","Nein","Nein","max. 250€ jährlich","Ja","Nein","Nein","Nein","Bestandteil der Leistungsart \"Proffesionelle Zahnreinigung\" mit gemeinsamen  Höchstsatz","Bestandteil der Leistungsart \"Proffesionelle Zahnreinigung\" mit gemeinsamen  Höchstsatz","Nein","Nein","200-400 € jährlich\n(50€/Stufe)","Nein","Nein","Nein"]
{"$rows_left_out":26}
{"sheet":"Listen","index":2,"n_rows":44,"n_cols":1,"rows_kept":44,"cut":false,"hidden":true,"merged":[]}
["SIGNAL IDUNA - GesundAKTIV+"]
["ALLIANZ - MeinGesundheitsBudget (alt)"]
["Allianz - MeineGesundheit (neu)"]
["Allianz - MeineGesundheit (neu) + RundumZahn 70"]
["Allianz - MeineGesundheit (neu) + RundumZahn 90"]
["Allianz - MeineGesundheit (neu) + RundumZahn 100"]
["Allianz - MeineGesundheit (neu) + Sehhilfe 100"]
["Allianz - MeineGesundheit (neu) + SehhilfeExtra"]
["ARAG - BudgetFlex Komfort"]
["ARAG - BudgetFlex Premium"]
["AXA - FlexMed easy"]
["AXA - FlexMed easy (neu)"]
["AXA - FlexMed easyPLUS"]
["AXA - FlexMed easyPremium"]
["BARMENIA - WellYouStart"]
["BARMENIA - WellYou"]
["Debeka - DebeCare"]
["Debeka - DebeCare Plus"]
["Debeka - DebeCare Best"]
["Münchener Verein - GemeinsamGesundBudget"]
{"$rows_left_out":25}
{"sheet":"Tabelle3","index":3,"n_rows":36,"n_cols":7,"rows_kept":36,"cut":false,"hidden":true,"merged":[[13,0,19,0],[13,1,14,2],[13,3,14,3],[19,1,19,2],[0,0,0,2],[1,1,1,2],[4,0,12,0],[4,1,4,2],[5,1,5,2],[6,1,6,2],[7,1,7,2],[8,1,8,2],[9,1,9,2],[17,5,18,5],[17,6,18,6],[18,1,18,2],[10,1,10,2],[11,1,11,2],[12,1,12,2],[28,1,28,2],[13,4,14,4],[15,1,15,2],[16,1,16,2],[17,1,17,2],[35,0,35,2],[29,1,29,2],[30,1,30,2],[31,0,31,2],[32,0,32,2],[33,0,33,2],[34,0,34,2],[20,0,30,0],[20,1,20,2],[21,1,21,2],[22,1,22,2],[23,1,23,2],[24,1,24,2],[25,1,25,2],[26,1,26,2],[27,1,27,2]]}
[null,null,null,"SIGNAL IDUNA","SIGNAL IDUNA","ALLIANZ","ALLIANZ"]
[null,"Tarifname",null,"GesundAGIL+ mit  ZahnBest+","GesundVITAL+ mit ZahnBest+ ZahnPerfekt+","MeinGesundheitsBudget kombi Plus","MeinGesundheitsBudget kombi Best"]
[null,null,"Tarifeinführung","2022-10-18","2022-10-18","2021-04-01","2021-04-01"]
[null,null,null,"300/600/900/1200/1500","300/600/900/1200/1500","300*/600/900/1200/1500","300/600/900/1200/1500"]
["ALLGEMEIN","Mindestzahl",null,"ab 3 MA ","ab 20 MA","Ab 10 MA**","Ab 10 MA"]
[null,"Auch für PKV-Versicherte"]
[null,"Ohne Gesundheitsprüfung"]
[null,"Volles Budget bei unterjährigem Beginn"]
[null,"Mitversicherung fehlender Zähne"]
[null,"Leistungen für angeratene/ laufende Behandlungen"]
[null,"Beitragsbefrei (b. AU > 6 Wo, Eltern-, Familienpflegezeit)"]
[null,"Weiterversicherung ",null,null,null,"Ja, ab 01.07.","Ja, ab 01.07."]
[null,"Mitversicherung Familienangehörige",null,null,null,"Ja, ab 01.07.2022","Ja, ab 01.07.2022"]
["ZAHN","Zahnersatz (Implantate, Brücken, Kronen)",null,"70 % ohne GKV-über das Budget","90 % ohne GKV über das Budget","70 % inkl. GKV über das Budget / ","90 % inkl. GKV über das Budget / "]
[null,null,null,null,null,"30 % ohne  GKV-Vorleistung","50 % ohne  GKV-Vorleistung"]
[null,"Kieferorthopädie nach Unfall",null,null,null," inkl. schwere Erkrank."," inkl. schwere Erkrank."]
[null,"Zahnbehandlung "]
[null,"Prof. Zahnreinigung",null," max. 300 € jährlich"," max. 300 € jährlich"," insgesamt max. 80-160 € jährlich je nach Budgethöhe"," insgesamt max. 80-160 € jährlich je nach Budgethöhe"]
[null,"Bleaching ",null," max. 100 € jährlich"," max. 100 € jährlich"]
[null,"Schmerzstillende Behandlungen"]
{"$rows_left_out":16}